stres1,stres2,stres3,stres4,stres5,stres6,stres7,stres8,stres9,stres10,stres11,stress12,stres13,stres14,stres15,stres16,stres17,stres18,stres19,stres20,stres21,stres22,stress23,stres24,stres25,stres26,xpct_1,xpct_2,xpct_3,ssi_1,ssi_2,ssi_3,ssi_4,prct_1,emtn_3,emtn_1,prct_2,prct_3,cord_1,cord_2,cord_3,cord_4,cord_5,efic_1,efic_2,efic_3,gndr,age,lenght,kids,howmanychild,relatives,howmanyrelatives,job,edu,hlth_1,hlth_2,hlth_3,hlth_4,hlth_5,howphysicalhealth,hearthproblems,insomnia,headache,backpain,frequentcolds,flu,diabets,cancer,asthma,hipertension,gastrotestinal,healthcompare,contactTurkish1,contactTurkish2,contactTurkish3,contactTurkish4,TOTALCONTACTTURKISH,contactRefugee1,contactRefugee2,contactRefugee3,contactRefugee4,TOTALCONTACTREFUGEE,howmanyTurkishfriend,howmanyRefugeefriend,visitTurkishfriend,visityouTurkish,visitRefugeefriend,visityouRefugee
2,1,1,3,1,1,2,1,3,3,3,1,2,2,3,3,3,2,1,1,1,1,1,3,1,3,5,6,5,7,4,6,4,2,3,3,5,5,1,5,4,1,1,5,7,7,1,33,5,1,3,2,4,8,4,5,5,5,1,5,5,2,2,2,1,2,2,2,2,2,2,2,3,1,1,1,1, ,1,1,1,1, ,3,5,2,1,5,5
3,1,2,3,1,1,1,1,1,1,1,1,3,1,1,1,3,1,1,1,1,1,3,3,1,3,6,6,6,7,7,7,7,5,4,5,5,5,2,5,4,2,1,6,5,5,2,30,12,1,1,2,4,6,4,3,3,2,3,3,4,2,2,1,2,2,2,2,2,2,2,2,3,1,1,1,1, ,1,1,1,1, ,2,4,1,2,4,4
3,2,2,3,1,1,2,3,2,3,2,1,3,2,2,2,3,1,3,1,1,1,2,2,1,3,6,6,6,6,6,5,5,4,4,4,4,4,1,1,4,1,1,6,6,6,1,41,22,1,4,2,4,1,7,3,3,2,2,2,2,2,1,1,1,2,2,2,2,2,2,1,3,2,2,1,1, ,2,1,1,1, ,3,5,3,3,5,5
3,2,2,3,1,1,2,3,2,3,2,1,3,2,2,2,3,1,3,1,1,1,2,2,1,3,6,6,6,6,6,5,5,4,4,4,4,4,1,1,4,1,1,6,6,6,2,41,,1,3,1,3,1,7,3,3,2,2,2,2,2,1,1,1,1,1,2,2,2,2,2,4,1,1,1,1, ,1,1,1,1, ,1,4,1,1,4,4
2,1,2,3,1,2,1,3,3,3,2,1,2,2,1,1,3,1,2,1,1,1,1,1,1,3,5,5,5,6,6,4,4,5,5,5,5,5,1,2,3,2,1,6,6,6,2,40,24,1,3,1,3,1,7,3,3,2,2,5,2,2,1,1,1,2,1,2,2,2,2,2,3,1,1,1,1, ,1,1,1,1, ,1,5,1,1,5,5
3,1,3,3,1,1,2,3,3,1,2,1,3,1,1,1,2,1,1,1,1,1,1,2,1,2,7,6,5,5,5,6,6,3,3,3,3,3,1,1,3,1,1,5,4,4,2,36,36,1,3,2,4,6,4,5,5,2,2,5,3,2,1,2,2,2,1,2,2,2,2,2,3,1,1,1,1, ,1,1,1,1, ,1,5,1,1,5,5
2,1,2,3,1,1,1,2,3,3,1,1,2,1,1,1,3,1,2,1,1,1,1,2,1,2,5,5,4,6,4,4,5,4,4,4,4,4,1,1,2,2,1,5,6,6,2,39,19,1,2,1,3,1,7,3,3,2,2,3,2,2,2,1,1,1,2,2,2,2,2,2,4,1,1,1,1, ,1,1,1,1, ,1,5,1,1,5,5
3,1,3,3,1,1,2,,3,1,1,1,3,1,2,1,2,1,1,1,1,1,1,3,1,3,5,5,5,5,5,5,5,2,2,2,2,1,1,2,2,2,1,5,4,4,2,26,36,2,4,2,4,7,7,4,4,4,2,4,4,2,2,2,2,2,2,2,2,2,2,2,3,1,1,1,1, ,1,1,1,1, ,1,5,1,1,5,5
3,1,3,3,1,2,2,3,3,2,2,1,3,3,3,3,3,1,3,1,1,1,3,3,3,3,3,3,3,5,5,5,5,2,2,2,3,3,1,1,2,1,1,3,3,4,1,40,18,1,4,1,2,1,6,5,5,1,1,5,3,2,2,1,1,2,2,2,2,2,2,2,3,1,1,1,1, ,1,1,1,1, ,1,5,1,1,5,5
3,1,3,3,2,2,3,3,2,3,1,1,3,1,1,1,2,1,1,1,1,1,1,1,1,2,6,6,4,5,5,5,5,3,4,3,3,3,1,3,3,1,1,6,7,5,2,35,20,1,1,1,2,1,5,3,3,2,2,3,2,2,1,1,1,1,2,2,2,1,2,1,4,1,1,1,1, ,1,1,1,1, ,2,4,2,2,4,4
1,1,2,3,1,1,1,2,1,2,1,1,2,1,1,2,3,1,2,1,1,1,1,1,1,1,7,7,5,6,2,3,3,1,3,3,2,2,1,1,1,1,1,6,6,6,2,49,4,,,2,4,6,4,5,5,1,1,3,2,2,1,2,2,2,2,2,2,2,1,2,4,1,1,1,1, ,1,2,2,2, ,1,5,1,1,5,5
3,1,1,3,1,1,2,3,1,2,1,1,3,1,2,1,2,1,2,1,1,1,1,2,1,3,4,5,6,5,6,5,5,3,3,2,2,3,1,1,1,1,1,6,6,4,2,23,40,1,1,2,4,7,4,3,5,5,5,4,3,2,2,2,2,2,2,2,2,2,2,2,4,1,1,1,1, ,1,1,1,1, ,1,4,1,1,2,4
2,1,1,3,3,3,2,1,1,3,2,1,2,1,1,1,3,2,1,1,1,1,1,1,1,2,5,6,7,6,7,1,1,4,4,3,2,3,2,1,1,1,1,5,3,5,2,30,,,,1,2,4,6,1,1,2,1,1,3,2,2,2,2,2,2,2,2,2,2,2,3,1,1,5,1, ,1,4,3,1, ,1,1,1,1,1,1
2,1,1,1,1,1,1,1,2,2,1,1,1,2,1,1,3,1,2,1,1,1,1,1,1,2,7,5,5,5,5,5,5,2,2,4,4,4,3,3,2,1,1,5,4,5,2,21,33,2,4,2,4,7,5,2,1,3,3,3,2,2,2,2,2,2,1,2,2,2,2,2,3,1,1,1,1, ,1,1,1,1, ,1,5,1,1,4,4
2,1,1,1,1,1,1,1,2,2,1,1,1,2,1,1,3,1,2,1,1,1,1,1,1,2,7,5,5,5,5,5,5,2,3,2,2,3,3,2,2,1,2,5,5,5,2,58,,2,4,2,4,1,5,2,1,3,3,3,2,2,1,1,1,1,2,1,2,2,1,2,3,1,1,1,1, ,1,1,1,1, ,1,4,1,1,3,3
2,1,2,3,1,1,1,3,2,2,1,1,1,2,1,1,3,1,2,1,1,1,1,1,1,2,7,5,5,5,5,5,5,2,3,2,2,3,3,2,2,1,2,5,5,5,1,69,,,,2,4,1,6,2,1,3,3,3,2,2,1,2,1,1,2,1,2,2,1,2,4,1,1,1,1, ,1,1,1,1, ,1,5,1,1,4,4
3,1,2,2,1,1,2,3,1,2,2,1,2,1,1,1,3,1,1,1,1,1,1,2,1,1,2,6,6,5,5,4,1,1,1,3,4,4,1,1,1,1,2,6,6,6,2,36,26,1,3,2,4,6,4,5,1,2,1,5,2,1,2,1,2,2,2,2,2,2,2,1,4,1,1,1,1, ,1,1,1,1, ,1,2,1,1,3,3
1,1,1,2,1,3,2,1,3,3,3,1,1,1,1,3,3,1,1,1,1,1,3,3,1,1,4,4,5,7,7,7,7,2,2,2,2,3,1,1,1,1,1,1,3,1,1,27,24,2,4,2,4,1,6,1,1,3,1,2,5,2,2,2,2,2,2,2,2,2,2,2,3,1,1,1,1, ,1,1,1,1, ,4,5,1,5,1,5
1,3,2,3,1,1,1,2,1,3,1,1,2,1,2,2,3,1,1,1,1,1,1,1,1,3,6,6,6,6,6,7,7,1,5,5,5,4,1,1,3,3,1,1,1,1,2,37,21,1,3,2,4,6,4,5,5,1,1,5,2,1,1,1,2,2,2,2,2,2,2,1,5,1,1,1,1, ,1,1,1,1, ,1,3,1,1,2,2
2,1,2,3,1,2,2,2,3,2,2,1,2,2,1,1,3,2,1,1,3,1,1,2,3,2,6,6,6,6,6,5,5,5,5,4,5,4,2,3,2,2,3,5,5,5,2,45,,,,1,3,8,6,1,1,3,3,2,2,2,1,2,2,2,2,2,2,2,2,2,3,1,1,1,1, ,1,1,1,1, ,1,5,1,1,2,3
2,1,3,3,3,1,2,2,1,2,3,1,3,3,2,1,3,1,1,1,1,1,1,2,1,3,4,6,4,6,5,5,4,1,2,2,1,1,1,1,1,1,3,4,4,3,1,40,24,,,1,3,4,2,2,3,2,3,2,2,2,2,2,2,2,2,2,2,2,2,2,4,1,1,1,1, ,1,1,1,1, ,1,3,1,1,2,2
3,3,3,1,1,3,3,3,2,3,2,1,2,1,1,1,3,2,3,1,1,1,1,2,1,3,7,5,6,6,6,7,6,5,4,4,4,5,1,3,2,5,3,7,3,3,1,50,,,,1,3,4,4,3,4,2,2,5,2,2,2,2,1,1,2,2,2,2,2,1,5,1,1,1,1, ,1,1,1,1, ,2,5,1,1,1,1
3,2,3,3,1,1,1,2,3,3,1,1,3,3,2,1,2,1,1,1,1,1,1,3,1,1,1,1,1,1,5,3,3,1,5,5,5,4,1,1,1,1,1,6,1,1,2,31,48,1,2,2,4,1,7,5,3,4,3,5,3,2,2,2,2,2,2,2,2,2,2,2,3,1,1,1,1, ,1,1,1,1, ,1,3,1,1,2,2
3,3,2,3,1,1,1,2,3,3,2,1,3,1,2,1,3,1,1,1,1,1,1,2,1,3,5,4,2,6,5,5,7,4,2,4,4,4,1,1,3,2,1,4,6,5,1,38,48,1,2,2,4,1,6,3,3,1,3,4,2,2,2,2,1,1,2,2,2,2,2,2,3,1,1,1,1, ,1,1,1,1, ,2,5,2,2,2,2
2,1,1,3,1,1,2,1,3,3,3,1,2,2,3,3,3,2,1,1,1,1,1,3,1,3,5,6,5,7,4,6,4,2,3,3,5,5,1,5,4,1,1,5,7,7,2,27,5,1,3,2,4,1,6,5,5,5,1,5,5,2,2,1,2,2,2,2,2,2,2,2,3,1,1,1,1, ,1,1,1,1, ,1,5,1,1,5,5
2,1,2,3,1,1,1,1,1,2,1,1,2,1,2,1,3,2,1,1,1,1,1,1,1,2,6,4,7,4,4,3,4,3,3,3,5,5,4,3,2,1,1,4,4,6,1,35,40,1,3,2,4,6,6,4,4,2,3,4,3,2,2,2,1,2,1,2,2,2,2,2,3,1,1,1,1, ,1,1,1,1, ,3,3,1,1,2,3
2,1,3,3,2,3,3,3,2,3,2,1,3,1,2,1,3,1,3,1,1,3,1,2,1,3,6,4,6,7,6,6,7,3,2,4,4,4,1,2,2,2,1,6,5,6,2,19,6,2,4,2,4,6,4,5,3,3,2,4,3,2,1,2,2,2,2,2,2,2,2,2,2,1,1,1,1, ,1,2,1,1, ,1,5,1,1,3,5
2,1,2,2,2,1,1,3,2,2,2,1,2,1,1,1,2,2,1,1,1,1,1,2,1,3,5,4,6,6,6,6,2,2,4,4,4,4,2,1,1,1,1,6,6,6,2,,14,1,4,2,4,6,4,3,1,2,3,2,4,2,1,2,1,2,2,2,2,2,2,1,3,1,1,1,1, ,1,1,1,1, ,1,5,1,1,4,5
3,1,3,2,1,1,3,3,3,2,3,3,3,2,2,1,3,1,1,1,1,1,1,2,3,3,2,2,2,5,5,7,7,1,5,5,5,3,1,2,2,2,5,5,2,7,1,65,12,1,5,2,4,8,3,5,5,2,1,5,2,2,1,1,2,2,2,2,2,2,2,2,4,1,1,1,1, ,1,2,1,2, ,1,1,1,1,1,1
2,1,1,3,2,2,1,2,3,2,2,1,2,1,1,1,2,2,2,2,2,1,1,1,1,1,4,5,4,3,5,4,5,3,3,2,4,4,1,1,1,2,1,3,5,5,1,29,36,2,4,2,4,1,6,4,2,3,4,2,4,2,2,2,2,2,2,2,2,1,2,2,3,2,2,2,1, ,1,1,1,1, ,2,3,1,1,4,4
2,2,3,2,1,1,2,1,1,3,2,1,2,1,1,1,3,1,3,1,1,1,1,1,3,3,5,6,3,6,7,6,6,4,4,4,3,2,1,1,1,1,1,6,6,7,2,46,,,,2,4,4,4,5,5,3,1,5,3,2,2,1,2,2,2,2,2,2,2,2,1,1,1,1,1, ,5,5,1,1, ,5,5,5,5,1,1
1,2,3,1,2,1,3,3,3,3,1,1,1,1,1,1,3,2,1,1,1,1,1,1,1,1,5,4,7,4,4,5,5,3,5,5,5,5,3,3,3,4,4,6,6,7,1,64,36,1,2,1,2,1,6,5,1,5,1,1,2,1,2,2,2,2,2,2,2,2,2,2,4,2,2,3,1, ,2,3,1,1, ,5,5,3,2,5,3
2,1,1,3,1,1,1,3,2,2,1,1,3,1,2,1,3,3,1,1,1,1,1,1,3,3,5,5,3,4,3,4,5,4,4,4,4,4,2,2,3,4,1,5,4,4,1,33,13,1,1,1,2,1,6,5,2,3,3,3,3,2,2,1,1,1,2,2,2,2,1,1,5,1,1,1,1, ,1,1,2,2, ,3,3,1,2,3,3
3,1,2,2,1,1,2,3,3,3,3,1,3,3,2,1,3,3,3,1,1,3,3,3,3,3,7,7,5,7,3,5,5,4,5,5,1,5,5,1,4,1,1,6,6,6,2,32,24,2,4,1,3,5,3,5,5,1,5,5,2,2,1,1,1,1,2,2,2,2,2,2,3,1,1,1,1, ,1,1,3,1, ,1,4,1,1,5,5
2,1,2,2,1,1,1,3,3,3,3,1,2,1,2,1,3,1,2,1,1,1,1,3,1,1,7,7,7,7,7,7,7,4,5,5,5,5,3,4,4,4,4,3,5,5,2,40,18,1,5,2,4,1,5,5,5,1,3,1,2,2,2,1,1,2,2,2,2,2,2,2,2,1,1,1,1, ,1,2,1,1, ,3,2,2,2,2,2
3,3,3,3,2,2,3,3,3,3,3,1,3,3,2,3,3,3,3,1,1,1,3,3,3,3,7,7,5,7,3,4,7,4,4,4,5,5,3,1,3,3,1,6,6,6,2,31,6,1,3,1,1,1,6,5,5,1,5,5,3,2,1,2,1,1,2,2,2,2,2,2,4,5,5,2,1, ,1,3,5,5, ,3,3,5,5,5,5
3,3,3,3,1,2,3,2,3,3,2,1,3,1,3,1,3,2,3,1,1,1,1,2,1,3,4,5,2,6,6,6,6,4,4,5,5,5,4,5,5,4,1,6,6,6,1,33,6,1,3,1,1,1,5,5,3,2,2,5,3,2,2,1,2,2,2,2,2,2,2,2,3,2,5,5,1, ,1,1,1,1, ,3,5,3,3,2,2
2,2,2,3,1,2,2,2,2,3,1,3,2,2,1,2,1,1,3,1,1,3,2,3,2,1,2,4,3,6,5,5,3,4,3,4,4,4,2,3,3,1,1,5,5,5,2,26,27,2,4,1,3,7,6,5,3,2,2,4,3,2,2,2,1,2,2,2,2,2,2,2,4,2,1,1,1, ,3,3,2,1, ,2,5,2,2,2,4
3,2,2,3,3,1,2,3,3,2,3,1,3,2,2,1,3,1,3,2,2,3,1,2,1,3,4,4,2,7,4,4,1,5,5,5,5,4,4,3,3,5,1,7,6,4,2,28,24,2,4,2,4,5,4,5,3,5,2,5,1,1,1,1,1,2,2,2,2,2,2,2,4,5,5,3,3, ,1,1,2,1, ,1,5,1,1,3,3
3,2,2,3,2,3,2,1,2,1,1,1,3,1,1,1,1,1,1,1,1,1,1,3,1,3,2,2,2,3,2,2,4,1,1,1,4,4,2,3,2,1,1,5,5,2,2,,,,,1,2,,,5,4,1,1,2,3,2,1,2,2,2,2,2,2,2,2,2,3,1,1,1,1, ,1,1,1,1, ,3,2,3,3,2,1
3,3,3,3,3,3,3,3,3,3,3,1,3,3,3,3,1,1,1,3,1,3,3,3,1,3,4,4,3,4,4,4,4,2,2,2,2,3,1,1,1,1,1,4,1,1,2,27,2,2,4,1,2,1,7,3,3,3,3,3,2,2,2,2,2,2,2,2,2,2,2,1,3,1,1,1,1, ,1,1,1,1, ,1,1,1,1,1,1
2,2,2,3,1,3,3,1,2,3,1,1,3,2,2,1,1,1,1,1,1,3,1,1,1,1,3,4,4,4,4,7,7,5,5,5,5,5,5,4,4,3,3,3,3,2,2,28,24,2,4,1,2,7,7,5,5,1,1,5,2,2,2,1,1,2,1,2,2,2,2,2,5,3,5,5,1, ,1,1,1,1, ,4,3,1,1,4,4
3,3,2,3,3,2,3,2,2,2,1,3,3,2,2,3,3,2,3,3,2,1,1,3,2,3,7,4,5,6,4,4,6,3,4,5,5,5,1,5,3,1,1,5,6,7,1,42,30,2,4,1,3,1,5,1,1,3,3,3,3,2,1,2,2,2,2,2,2,2,2,2,3,1,1,1,1, ,1,1,1,1, ,1,3,1,1,1,1
2,2,1,3,3,3,1,3,3,3,1,2,1,3,1,3,3,1,2,2,3,2,3,3,3,2,6,3,1,5,6,3,2,3,4,2,1,3,1,1,1,1,3,4,6,7,1,18,1,2,4,1,3,5,4,5,5,4,1,4,3,2,2,1,2,2,2,2,2,2,2,2,3,1,1,1,1, ,1,1,1,1, ,1,1,1,1,2,1
2,1,2,1,1,2,1,2,2,3,1,1,1,1,1,2,2,1,3,1,1,2,1,3,3,1,2,4,5,5,5,4,2,3,4,4,5,5,3,3,3,4,3,3,3,5,1,19,36,1,2,2,4,7,5,2,3,3,2,3,3,2,2,2,2,2,2,2,2,2,2,2,1,1,1,1,1, ,1,1,1,1, ,1,2,2,2,5,5
2,1,2,3,2,2,2,2,2,1,1,3,2,3,1,3,1,2,3,3,1,1,2,3,3,3,2,3,4,6,2,2,2,2,3,3,4,3,1,1,2,1,2,4,5,6,1,18,32,2,4,1,3,7,5,3,1,5,4,1,5,2,2,1,2,2,2,2,2,2,2,2,1,1,1,3,1, ,1,1,1,1, ,5,2,5,3,1,1
1,2,1,2,1,1,3,3,2,1,1,1,1,2,2,2,2,2,3,3,2,2,2,3,3,3,3,3,4,3,4,3,4,4,3,3,4,4,3,4,4,3,4,5,4,6,2,18,,,,,,6,3,4,3,4,3,5,2,2,2,1,1,1,2,2,2,1,2,2,3,1,1,1,1, ,1,1,1,1, ,1,1,1,1,1,1
3,2,2,1,1,1,3,3,3,3,3,1,3,3,3,3,3,1,3,1,1,1,3,3,2,3,3,3,3,3,3,4,3,5,5,5,5,5,4,5,5,5,1,5,5,5,2,37,,,,1,3,6,4,4,2,4,4,4,2,2,1,1,1,1,2,2,2,2,1,2,2,2,3,1,1, ,1,1,1,1, ,2,5,1,1,5,5
3,3,3,3,2,3,2,3,3,2,1,3,3,3,3,3,2,1,2,3,2,2,3,3,3,3,7,6,7,7,7,7,7,4,5,5,5,5,4,5,5,4,3,6,5,4,1,52,1,1,6,1,1,1,6,1,1,5,3,3,3,2,2,2,1,2,2,2,2,2,2,2,2,3,1,1,1, ,1,1,1,1, ,4,4,3,1,2,2
3,2,2,2,1,3,3,2,3,1,1,3,2,2,2,3,1,2,1,1,1,1,2,3,2,3,6,6,5,6,5,5,5,1,3,5,5,5,1,5,5,2,2,5,5,6,1,49,24,1,5,2,4,1,7,4,4,1,1,3,3,2,2,1,1,2,2,2,2,2,2,1,3,1,1,1,1, ,3,3,1,1, ,3,3,1,1,2,2
3,1,1,1,1,1,1,1,1,1,1,1,3,1,1,1,2,1,2,1,1,1,1,1,1,3,1,2,3,3,4,4,4,1,4,1,4,5,3,4,4,4,1,6,4,6,2,45,36,2,4,2,4,1,7,5,5,1,1,5,5,2,2,2,2,2,2,2,2,2,2,2,3,2,1,1,1, ,3,3,1,1, ,5,2,5,5,1,1
3,3,2,2,2,3,2,2,3,3,1,3,3,2,1,2,3,2,3,1,1,2,2,3,3,2,4,6,5,7,4,5,5,3,2,5,4,4,5,5,2,2,1,5,4,2,2,28,12,,,1,2,7,5,4,4,2,2,3,3,2,1,1,1,2,2,2,2,2,2,2,3,2,1,1,1, ,1,1,1,1, ,1,5,2,1,5,5
3,3,2,3,2,3,1,1,2,3,3,1,3,3,1,3,3,1,3,1,1,1,1,1,3,3,6,7,5,5,7,7,1,3,2,5,5,5,5,3,3,3,5,5,5,4,1,20,12,2,4,2,4,7,6,5,5,2,1,5,2,2,2,2,1,2,2,2,2,2,2,2,3,2,2,1,1, ,5,1,1,5, ,3,3,1,5,5,5
3,3,3,3,1,1,1,1,2,1,1,1,1,2,2,2,1,1,1,2,2,2,2,2,1,1,5,4,3,6,7,7,7,3,4,5,5,5,1,1,1,1,1,6,4,2,2,28,24,2,4,1,3,1,5,5,5,1,1,5,5,2,2,2,2,2,2,2,2,2,2,2,3,1,1,1,1, ,1,1,1,1, ,5,5,5,5,5,5
3,3,3,3,2,2,3,3,3,3,3,2,3,2,2,2,3,2,3,2,2,2,2,2,2,3,7,7,6,6,5,6,6,2,3,3,5,5,1,1,2,2,5,2,2,3,1,38,48,,,1,2,8,4,5,5,1,1,5,2,2,1,1,1,2,2,2,2,2,2,2,3,1,1,1,1, ,1,1,1,1, ,2,5,2,2,5,5
2,2,1,2,2,3,3,3,3,2,1,3,2,2,3,3,1,2,3,2,1,3,1,3,3,3,7,4,4,5,5,6,6,3,4,3,3,4,1,1,1,1,1,5,6,6,2,32,10,1,4,1,3,6,4,3,2,4,2,3,1,2,2,1,2,1,2,2,2,2,2,2,3,1,1,1,1, ,1,1,1,1, ,1,5,1,1,3,3
3,1,1,1,1,1,2,3,1,2,1,1,2,1,1,2,2,2,3,2,3,2,3,3,3,3,6,5,6,6,7,6,6,4,3,3,3,4,5,5,5,5,4,5,6,5,2,35,24,1,4,1,3,6,4,5,4,5,1,5,1,2,2,2,2,2,1,2,2,1,2,2,3,1,1,1,1, ,1,1,1,4, ,4,3,2,2,1,2
3,1,1,3,1,2,1,2,2,2,1,3,3,3,2,3,2,1,2,1,1,1,3,2,1,1,5,6,5,7,7,5,6,4,5,5,5,5,3,1,2,1,1,7,6,7,2,27,32,2,4,1,3,1,6,5,5,2,3,5,5,2,2,2,2,2,2,2,2,2,2,2,3,2,3,1,1, ,1,1,1,1, ,3,5,3,2,3,3
3,3,3,3,2,2,1,2,2,3,2,2,2,2,1,1,3,1,1,1,1,1,2,2,3,3,4,4,4,4,4,4,4,1,5,5,3,3,1,2,2,2,3,3,3,3,1,45,37,1,6,2,4,8,6,5,5,1,1,5,4,2,2,1,2,2,1,2,2,2,2,2,3,1,1,1,1, ,1,1,1,1, ,3,2,2,2,3,2
3,3,3,3,2,2,2,2,2,3,3,2,3,2,2,2,3,3,3,2,2,3,2,3,3,3,5,5,5,5,5,4,4,1,1,1,3,1,1,1,1,2,5,6,6,6,1,51,,,,2,4,8,6,4,4,3,4,5,5,1,2,2,2,2,2,2,2,2,2,2,1,1,1,1,1, ,1,1,1,1, ,2,5,1,1,3,3
2,1,,3,1,1,2,2,1,1,2,1,3,2,1,2,3,1,2,1,1,1,2,2,1,2,2,2,1,1,1,2,7,3,4,4,3,4,1,2,2,1,1,1,1,2,2,26,4,2,4,1,3,7,6,5,5,1,3,5,4,2,1,1,1,2,2,2,2,2,2,2,3,1,1,1,1, ,2,1,1,1, ,1,2,1,1,1,1
3,2,1,3,2,1,3,1,2,1,1,1,2,2,2,2,1,2,3,1,1,3,2,3,2,3,6,6,5,5,4,4,4,4,5,5,4,4,4,3,2,2,2,4,7,7,2,19,9,2,4,2,4,7,6,5,2,5,2,5,4,2,2,1,2,2,2,2,2,2,2,2,4,1,1,1,1, ,1,1,1,1, ,3,5,5,5,5,5
3,2,1,3,1,2,3,3,2,1,1,1,3,3,3,2,1,1,1,1,1,2,3,3,3,3,2,2,2,2,2,2,2,1,1,2,3,3,1,1,1,1,1,2,5,5,2,24,36,2,4,2,4,7,6,5,1,5,5,1,3,2,2,1,1,2,2,2,2,2,2,2,1,1,1,1,1, ,1,1,1,1, ,5,5,5,5,1,5
3,3,3,2,2,3,2,1,1,3,1,1,3,3,3,3,3,2,1,1,1,1,3,3,2,2,7,4,6,6,6,6,4,4,5,5,5,5,5,5,1,1,2,4,5,6,2,32,,1,4,1,3,6,6,2,2,1,1,2,2,2,1,1,1,2,2,2,2,2,2,2,3,5,5,1,1, ,1,1,1,1, ,5,5,2,2,5,5
3,1,3,3,1,1,3,3,1,3,2,2,3,3,1,1,3,1,1,1,1,1,3,3,3,3,2,5,2,6,7,1,6,3,3,4,1,2,1,1,1,3,3,5,1,1,1,47,5,1,6,1,3,4,3,5,5,1,1,1,1,2,1,2,2,2,2,1,2,2,2,2,3,1,1,1,1, ,1,1,1,1, ,2,5,2,2,5,5
3,3,1,3,2,3,3,1,3,1,1,2,3,1,1,3,2,3,3,1,1,1,2,3,2,1,4,7,4,7,7,7,7,5,5,4,5,5,4,4,4,4,4,6,7,7,1,28,28,2,4,1,2,8,5,5,5,2,1,1,2,2,1,2,2,2,2,2,2,2,2,2,3,1,1,1,1, ,1,1,1,1, ,5,5,1,5,5,5
1,1,2,1,1,1,1,2,3,2,1,1,1,1,1,1,2,1,1,1,1,1,1,1,3,2,4,2,6,6,5,1,2,2,3,4,4,4,1,1,1,1,1,2,5,3,1,79,25,,,2,4,1,7,1,1,5,5,1,1,1,2,2,2,2,2,2,2,2,2,2,5,1,1,1,1, ,1,1,1,1, ,1,1,1,1,1,1
3,1,1,1,1,1,1,3,1,1,1,1,2,1,1,1,3,1,1,1,1,1,1,1,3,3,2,2,4,4,4,4,4,4,4,4,2,1,1,1,1,1,1,6,6,6,2,35,,1,5,1,3,6,3,3,3,3,3,3,1,2,2,1,1,2,2,1,2,2,2,2,4,1,1,1,1, ,1,1,1,1, ,4,4,3,3,4,4
3,2,2,1,1,2,3,3,3,1,3,1,2,1,1,1,3,1,2,1,1,1,1,3,1,1,5,5,4,7,7,6,6,4,4,3,4,4,3,4,4,3,2,6,6,4,1,45,,1,1,1,2,1,7,3,3,2,4,3,4,2,2,2,2,1,2,2,2,2,2,1,3,2,1,1,1, ,2,1,1,1, ,3,4,2,2,3,4
3,3,2,2,2,2,2,1,3,2,2,3,3,2,1,2,2,2,1,1,1,3,2,3,3,2,6,6,6,7,6,6,6,4,4,5,5,5,2,5,5,3,2,6,3,5,2,28,24,2,4,1,3,1,6,1,5,5,1,5,3,2,1,1,2,2,2,2,2,2,2,2,3,1,1,1,1, ,1,1,1,1, ,2,5,2,3,3,5
2,3,2,2,3,1,2,2,3,3,2,3,3,1,1,3,2,2,1,2,1,3,1,3,2,3,6,6,5,7,6,4,2,3,2,4,5,5,2,4,5,4,2,6,4,6,2,27,14,2,4,1,3,1,6,5,5,5,1,5,3,2,1,1,2,1,2,2,2,2,2,2,3,1,2,3,1, ,1,2,1,1, ,3,2,2,2,5,5
2,3,2,3,3,2,2,3,2,2,2,3,2,2,3,3,2,2,2,3,3,2,3,2,3,1,6,5,6,7,7,6,6,4,3,4,4,5,3,3,2,3,2,6,5,5,2,53,40,,,1,3,1,5,1,5,5,1,1,2,2,1,1,1,2,2,2,2,2,2,2,4,2,2,2,1, ,1,1,2,1, ,2,5,2,2,5,5
1,1,1,1,2,1,1,1,1,1,2,1,2,2,1,1,2,2,1,1,1,1,2,1,2,2,2,4,3,2,4,3,3,3,3,4,4,4,5,5,5,5,5,3,4,5,1,42,36,1,3,2,4,1,7,5,1,5,5,1,3,2,2,1,2,2,2,2,2,2,2,2,1,1,1,1,1, ,1,1,1,1, ,4,5,4,3,5,5
3,1,1,1,1,1,1,3,1,1,1,1,2,1,1,1,3,1,1,1,1,1,1,2,3,3,3,4,6,6,6,6,3,4,4,4,4,4,1,1,1,4,1,6,6,6,2,48,,1,3,1,3,1,5,3,3,3,3,3,2,1,2,1,1,2,2,2,2,2,2,2,3,1,1,1,1, ,1,1,1,1, ,2,4,2,2,4,4
2,2,3,2,1,1,1,1,1,2,2,1,2,3,1,2,3,2,1,1,1,1,2,2,1,2,5,6,3,6,4,4,4,3,4,3,3,3,3,3,3,1,1,2,3,5,2,23,4,1,2,2,4,1,5,5,1,5,5,1,2,2,2,2,2,2,1,2,2,2,2,2,1,2,1,1,1, ,1,1,1,1, ,1,5,1,1,5,5
3,2,1,3,1,1,3,3,3,3,2,1,3,1,2,1,1,1,3,1,1,1,3,3,1,3,7,3,5,7,3,7,3,3,5,5,5,5,1,5,3,1,1,4,5,1,2,43,12,1,4,2,4,6,3,5,1,5,5,1,3,2,2,2,2,2,2,2,2,2,2,2,1,1,1,1,1, ,1,1,1,1, ,1,5,1,1,5,5
3,1,1,3,1,1,1,3,1,1,1,1,2,1,1,1,3,1,1,1,1,1,1,2,3,3,3,4,6,6,6,6,3,4,4,4,4,4,1,4,4,1,1,6,6,6,2,36,36,1,1,1,3,6,5,3,3,3,3,3,2,2,2,2,1,2,1,2,2,2,2,2,3,1,1,1,1, ,1,1,1,1, ,4,4,3,3,4,4
1,1,2,3,1,1,1,2,3,3,1,1,3,2,1,3,3,1,3,1,1,1,2,3,3,1,7,2,5,6,4,4,4,3,4,4,5,4,4,4,4,4,1,7,5,5,1,47,24,1,1,1,3,1,7,3,2,2,2,2,3,2,2,2,1,2,2,2,2,2,1,2,3,1,1,1,1, ,2,2,1,1, ,3,5,1,1,3,3
3,2,1,1,1,1,1,1,3,3,3,1,3,2,1,1,1,1,2,1,1,1,1,3,1,3,7,4,6,7,6,6,3,4,3,3,5,5,2,5,2,1,1,6,7,7,2,29,12,,,1,3,1,5,5,5,5,5,5,4,2,2,2,2,1,2,2,2,2,2,2,1,1,1,1,1, ,1,1,1,1, ,5,5,5,5,1,5
3,1,1,1,1,1,1,1,1,1,2,1,3,1,1,1,3,1,1,1,1,1,1,3,1,3,6,6,6,6,6,6,3,5,4,4,5,5,2,5,5,1,1,6,7,6,2,28,18,,,1,3,1,5,5,1,1,5,1,2,2,2,2,2,1,2,2,2,2,2,2,3,1,1,1,1, ,1,1,1,1, ,5,5,5,5,1,5
3,2,2,2,1,1,3,3,3,3,3,3,3,1,1,1,3,2,3,1,1,1,1,3,3,3,7,4,1,7,7,7,7,4,4,5,5,5,4,1,2,4,2,4,6,6,2,53,,,,2,4,1,5,4,4,4,4,4,3,2,2,2,2,2,2,1,2,2,2,2,2,3,3,3,1, ,1,1,1,1, ,2,5,1,1,5,5
3,1,1,3,1,2,2,2,3,3,2,3,3,3,2,3,3,3,3,2,3,3,3,3,3,2,6,6,6,6,6,6,1,4,4,5,5,5,5,5,5,4,2,6,6,6,2,37,,1,3,1,2,1,7,5,5,5,5,5,5,2,2,1,2,2,2,2,2,2,2,2,2,1,1,1,1, ,1,1,1,1, ,5,5,5,5,5,5
3,1,1,3,1,1,3,3,1,2,1,1,2,1,1,1,3,1,3,1,1,1,1,3,1,3,5,5,6,5,6,7,7,3,3,4,5,5,1,3,3,3,2,6,6,6,2,50,40,1,7,2,4,1,5,3,4,3,3,5,2,2,1,2,2,2,2,2,2,2,2,2,3,1,1,1,1, ,1,1,1,1, ,3,5,5,5,5,5
3,1,2,3,1,2,3,2,3,3,2,1,3,1,1,1,3,1,2,1,1,3,1,1,1,1,5,5,4,5,4,4,5,3,4,4,5,5,1,3,1,1,1,4,4,3,2,40,3,2,4,2,4,1,5,3,5,2,1,4,2,2,1,1,1,2,1,2,2,2,1,2,3,1,1,1,1, ,1,1,1,1, ,2,3,2,2,2,2
1,1,1,1,1,1,1,1,1,1,1,1,1,1,1,1,2,1,1,1,1,1,1,1,2,2,4,2,5,6,6,6,1,1,5,4,4,3,1,1,1,1,3,6,6,6,2,50,13,2,4,1,2,1,6,4,5,4,5,4,3,2,2,2,2,2,2,2,2,2,2,2,4,3,3,1,1, ,1,1,1,1, ,1,3,1,2,4,4
3,3,2,3,3,3,2,2,3,2,2,3,2,1,1,1,3,1,1,1,1,1,1,3,1,3,4,5,4,5,5,5,5,4,4,4,4,4,1,5,3,1,1,6,6,6,2,31,18,1,3,1,2,1,5,2,1,2,2,1,3,2,2,1,1,1,1,2,2,2,2,2,3,1,1,1,1, ,1,1,1,1, ,2,2,1,2,5,5
2,1,,3,1,1,2,2,2,1,1,1,2,1,1,1,3,1,1,1,1,1,1,1,2,2,5,4,4,5,5,6,6,3,4,3,1,2,1,1,1,1,1,1,4,4,2,39,,1,2,1,2,1,7,5,5,2,2,4,3,2,2,2,2,2,2,2,2,2,2,2,3,1,1,1,1, ,1,1,1,1, ,1,4,1,1,4,4
3,3,3,3,1,1,3,3,3,3,3,1,3,3,3,3,3,1,3,1,1,1,3,3,3,3,4,4,4,4,4,3,3,2,2,2,2,2,2,2,2,2,2,1,3,3,2,43,20,1,4,1,3,6,4,5,5,2,2,4,2,2,2,1,1,1,1,2,2,2,2,1,4,1,1,1,1, ,1,1,1,1, ,1,5,1,1,5,5
2,1,2,3,1,1,1,1,1,1,1,1,3,1,2,1,3,1,1,1,1,1,1,3,3,2,3,3,5,5,5,5,5,2,3,5,5,5,2,2,1,1,1,3,5,4,2,39,36,1,4,2,4,6,6,4,4,2,2,5,3,2,2,2,2,1,1,2,2,2,2,1,3,1,1,1,1, ,1,1,1,1, ,1,5,1,1,5,5
2,1,2,3,1,1,2,3,2,2,2,3,3,1,1,1,2,2,2,2,1,1,1,1,1,1,4,4,4,4,4,4,4,2,3,3,4,4,3,2,2,2,2,4,4,4,1,,34,,,1,3,1,5,3,3,3,2,2,3,2,1,2,1,2,2,2,2,2,2,1,1,2,1,1,1, ,1,1,1,1, ,3,2,2,4,2,2
3,1,2,3,2,1,2,3,3,1,1,1,3,2,2,1,3,2,1,1,1,1,1,3,1,2,4,5,3,6,6,6,4,4,4,3,5,5,2,2,2,4,3,6,6,6,1,31,18,1,1,1,3,1,6,5,5,1,3,5,4,2,2,2,1,2,2,2,2,2,2,2,3,1,1,1,1, ,2,1,2,1, ,3,5,3,3,2,2
3,1,3,3,1,3,3,1,3,1,1,1,3,2,2,1,1,1,1,1,1,1,1,1,1,1,7,4,4,5,5,5,4,3,5,5,5,5,5,5,5,1,1,2,5,1,2,28,19,2,4,1,3,1,6,5,3,1,2,3,2,2,1,1,1,1,1,2,2,2,2,1,4,1,1,1,1, ,1,1,1,1, ,4,5,1,1,5,5
3,1,1,1,1,1,1,3,1,1,1,1,2,1,1,1,3,1,1,1,1,1,1,2,3,3,3,4,6,6,6,6,3,4,4,4,4,4,3,3,4,4,1,6,6,6,2,43,36,1,1,1,3,1,6,3,3,3,3,3,3,2,2,1,2,2,2,2,2,2,2,2,3,1,1,1,1, ,1,1,1,1, ,4,4,3,3,4,4
2,1,1,3,2,1,2,2,1,3,2,1,3,2,2,1,3,1,2,1,1,1,1,3,1,3,3,3,2,5,4,5,2,1,3,4,4,3,1,3,4,1,1,6,6,5,2,30,16,1,1,1,3,1,7,5,5,2,2,5,4,2,2,1,2,2,2,2,2,2,2,2,4,1,1,1,1, ,1,1,1,1, ,1,5,1,1,5,5
2,1,1,3,1,1,2,1,1,1,,1,3,1,2,1,2,1,2,1,1,1,1,2,1,1,4,4, ,5,4,4,5,4,2,2,5,5,1,3,1,3,1,5,6,6,2,32,36,2,4,2,4,1,5,5,5,1,1,1,3,2,2,1,1,1,2,2,2,2,2,2, ,1,1,1,1, ,1,1,1,1, ,5,5,1,1,5,5
2,3,1,2,1,2,1,1,3,3,1,1,2,1,1,2,3,3,1,1,2,3,1,3,3,3,1,2,5,7,4,1,7,3,5,5,5,2,1,5,1,1,1,5,6,6,1,31,4,,,1,3,1,6,3,2,5,5,3,5,2,2,2,2,2,2,1,2,2,2,1,3,1,1,1,1, ,1,1,1,1, ,3,4,2,1,3,3
3,3,3,3,2,1,3,1,1,1,1,1,3,1,2,1,2,1,2,3,1,1,1,3,3,3,7,7,5,4,7,7,7,3,5,4,5,5,5,5,3,5,5,5,6,7,1,42,4,1,3,2,4,1,7,1,1,4,4,5,3,2,2,2,2,2,2,2,2,2,2,1,4,1,1,1,1, ,1,1,1,1, ,2,4,2,1,4,4
3,1,1,3,1,3,2,3,3,3,2,3,3,1,2,2,3,1,2,1,1,1,2,1,3,3,7,7,5,4,7,5,5,3,2,2,4,5,1,2,3,2,1,4,6,6,1,,7,,,1,2,1,5,5,5,5,1,5,2,2,1,2,2,2,2,2,2,2,2,2,2,1,1,1,1, ,1,1,1,1, ,1,5,1,1,5,5
3,3,3,2,2,3,3,3,3,2,1,2,3,2,3,3,2,,2,2,1,3,2,3,3,2,5,5,5,6,6,5,5,3,4,4,4,4,2,3,3,3,2,6,6,6,1,37,24,,,1,2,1,6,3,2,3,3,3,4,2,2,2,2,2,1,2,2,2,2,2,2,1,1,1,1, ,1,1,1,1, ,2,3,2,2,3,3
3,3,2,3,1,2,3,1,2,1,2,3,3,2,,3,3,2,2,2,1,1,3,3,3,3,6,6,6,6,6,7,7,5,4,4,5,5,1,4,4,4,3,5,6,6,1,56,10,1,3,2,4,1,6,5,5,1,1,5,2,2,1,2,2,2,2,2,2,2,2,2,4,5,5,3,1, ,1,1,1,1, ,5,5,2,2,5,5
3,1,3,3,1,2,3,3,3,3,3,1,3,3,3,1,3,1,3,1,1,1,3,3,3,3,4,2,4,5,5,5,5,2,5,5,5,5,1,4,3,2,1,2,4,4,2,30,24,1,5,1,3,6,3,5,5,1,1,5,2,2,1,1,1,1,1,2,2,2,2,1,4,1,1,1,1, ,1,1,1,1, ,1,5,1,1,5,5
3,1,2,3,1,2,2,3,3,1,3,1,3,2,2,1,3,1,3,1,1,1,3,3,3,3,5,5,5,5,5,5,5,2,2,3,3,3,1,2,1,3,1,3,4,3,2,35,21,1,3,1,3,6,4,5,5,1,3,4,3,2,1,2,1,2,2,2,2,2,2,1,3,1,1,1,1, ,1,1,1,1, ,1,5,1,1,5,5
3,2,2,3,1,1,2,2,3,2,2,1,3,1,1,1,3,1,2,,,1,,2,2,3,5,3,5,5,4,5,4,3,5,4,5,3,1,3,2,4,1,6,7,6,1,56,5,1,3,1,3,1,7,5,5,2,5,5,3,2,1,2,2,2,2,2,2,2,2,2,3,1,1,1,1, ,1,1,1,1, ,1,5,1,1,3,3
1,3,1,3,1,1,1,1,2,2,1,1,2,,1,1,1,2,1,1,1,1,1,1,1,3,6,5,3,3,4,5,4,2,5,5,5,5,,4,4,4,4,5,2,5,1,,,,,1,2,,7,2,2,2,2,2,3,2,1,2,1,,2,2,2,1,2,2,3,2,1,2,1, ,2,2,2,1, ,2,3,4,4,2,2
1,1,1,3,1,1,1,2,2,2,1,1,1,1,1,1,2,1,1,1,2,,2,1,,2,6,7,7,6,4,5,5,1,3,3,3,3,1,1,1,1,1,2,6,2,1,,,,,2,4,1,6,2,2,5,3,,3,2,2,2,2,2,2,2,2,2,2,2,4,2,1,1,1, ,1,1,1,1, ,1,2,1,1,2,2
3,3,3,3,2,1,3,2,3,3,3,1,3,3,3,1,3,1,3,1,1,1,1,3,2,3,2,2,1,5,5,5,2,3,3,5,5,5,1,1,2,2,2,3,5,3,2,45,,1,1,2,4,6,1,5,5,1,1,5,2,2,2,2,1,2,2,2,2,2,2,2,5,1,1,1,1, ,1,1,1,1, ,2,1,1,1,5,5
2,1,2,3,1,1,2,1,1,1,3,1,3,3,3,1,3,1,1,1,1,1,1,2,1,3,1,2,1,3,2,3,3,5,5,4,4,4,2,3,5,2,2,5,5,3,1,35,24,,,1,3,1,6,2,1,2,5,3,4,2,2,2,1,1,2,2,2,2,2,2,1,1,1,1,1, ,1,1,1,1, ,5,5,1,1,3,5
3,3,3,3,,1,3,2,3,3,,,3,3,3,1,3,1,3,1,1,,1,3,1,3,2,2,3,2,4,2,1,3,4,3,3,3,1,1,1,1,2,2,2,3,2,18,13,1,1,2,4,6,2,2,2,1,1,2,2,2,2,1,2,2,2,2,2,2,2,2,5,1,1,1,1, ,1,1,1,1, ,1,1,1,1,1,5
3,1,2,3,1,1,2,1,2,3,2,1,2,1,2,1,2,1,3,1,1,1,1,3,3,3,4,4,5,4,6,2,1,5,2,5,5,3,5,1,5,5,1,2,2,3,1,25,4,2,4,2,4,2,4,3,3,1,1,2,2,2,2,1,1,2,2,2,2,2,2,2,5,1,1,1,1, ,1,1,1,1, ,1,1,1,1,5,5
2,1,1,3,1,2,1,3,1,2,2,1,3,2,2,1,3,1,1,1,1,2,2,2,1,3,4,4,5,6,4,4,4,3,2,1,5,4,1,3,1,5,1,6,3,6,1,22,6,2,4,1,3,4,4,3,4,5,4,5,3,1,2,1,1,2,2,2,2,2,1,2,4,1,1,1,1, ,1,1,1,1, ,1,5,1,1,5,5
2,1,1,3,1,2,1,3,1,2,2,1,3,2,2,1,3,1,1,1,1,2,2,2,1,3,4,4,5,6,4,4,4,3,2,1,5,4,1,3,1,5,1,6,3,6,1,22,5,2,4,1,3,4,4,4,2,5,2,5,4,2,2,2,1,1,2,2,2,2,2,2,4,1,1,1,1, ,1,1,1,1, ,1,5,1,1,4,5
3,1,2,3,2,2,3,2,3,3,3,1,3,3,3,2,3,1,1,1,1,1,1,3,1,3,2,2,2,2,2,2,1,2,3,4,5,5,5,5,3,5,5,1,3,1,1,25,18,1,1,1,3,8,4,2,2,5,5,1,1,2,2,2,2,2,2,2,2,2,2,2,4,1,1,1,1, ,2,1,2,1, ,1,5,1,1,5,5
3,1,3,1,1,1,1,1,1,3,1,1,3,3,3,1,1,1,1,1,1,1,1,1,1,1,3,4,6,7,1,4,1,1,1,1,1,1,1,1,1,1,1,1,1,1,2,19,12,1,1,1,2,6,4,2,1,2,1,,1,2,2,1,2,2,2,2,2,2,2,2,5,1,1,1,1, ,1,1,1,1, ,1,5,1,1,5,5
3,3,3,3,1,3,3,3,3,3,3,1,3,3,3,3,3,1,2,1,1,1,3,3,1,3,5,2,1,5,7,2,7,5,5,5,5,5,2,4,2,2,2,1,4,1,2,28,24,1,3,1,2,4,6,5,5,1,1,5,2,2,1,1,1,1,1,2,2,2,1,1,5,1,1,1,1, ,1,1,1,1, ,1,2,1,1,1,3
3,3,3,3,2,1,2,1,2,1,2,1,3,2,3,1,3,2,1,1,1,1,1,3,2,3,2,2,3,3,6,2,1,3,1,2,2,2,1,1,2,1,1,2,3,3,1,35,22,1,2,2,4,4,4,3,3,2,1,2,2,2,2,2,1,2,2,2,2,2,2,2,5,1,1,1,1, ,2,2,1,1, ,2,5,1,1,3,1
1,1,1,1,1,1,1,2,1,1,1,1,1,1,1,1,3,1,1,1,1,1,1,1,1,2,1,1,3,7,7,7,4,4,4,5,5,5,5,4,4,,2,5,4,6,1,55,36,1,5,2,4,4,3,1,1,1,1,1,2,1,2,2,2,2,2,1,2,2,1,2,3,1,1,1,1, ,1,1,1,1, ,1,1,1,1,1,1
2,2,2,2,2,2,2,2,2,2,2,2,2,2,2,2,2,2,2,2,2,2,2,2,2,2,4,3,3,2,5,2,1,3,2,3,5,5,1,4,,3,1,1,3,1,1,24,28,2,4,2,4,4,2,5,5,1,1,1,1,2,2,2,2,2,2,2,2,2,2,2,1,1,1,1,1, ,1,1,1,1, ,1,1,2,1,1,1
3,1,3,3,1,2,3,3,2,3,3,1,3,2,3,2,3,1,2,1,1,1,1,3,1,2,4,3,5,5,7,2,1,3,4,5,5,2,3,3,3,3,3,5,5,2,2,21,1,1,2,2,4,6,2,3,3,1,1,2,2,2,2,1,2,2,2,2,2,2,2,2,5,1,1,1,1, ,1,2,2,1, ,1,5,1,1,3,3
3,1,1,2,1,1,3,1,2,1,2,1,3,1,2,1,3,1,1,1,1,1,1,3,1,1,2,2,3,6,6,2,2,3,3,2,2,2,1,1,1,1,1,2,2,2,2,32,12,1,2,2,4,6,4,2,2,1,1,2,2,2,2,1,2,2,2,2,2,2,2,2,4,1,1,1,1, ,1,1,1,1, ,1,2,1,1,5,5
3,1,3,3,1,1,3,,3,1,3,2,,2,,1,1,1,3,3,3,3,3,3,3,3,6,6,6,7,7,5,5,1,4,3,1,1,1,1,5,3,1,1,1,5,2,26,25,1,3,1,1,6,1,1,4,5,1,5,2,2,2,2,2,2,2,2,2,2,2,1,5,5,5,1,1, ,1,1,1,1, ,1,1,1,1,1,1
3,1,3,3,1,1,3,3,3,1,3,3,3,2,3,3,3,3,3,3,3,3,3,3,3,3,6,6,6,7,7,7,2,1,4,3,1,1,1,1,5,3,1,1,1,5,1,30,25,1,3,1,1,4,2,1,4,5,1,5,2,2,2,1,2,2,2,2,2,2,2,2,5,5,5,1,1, ,1,1,1,1, ,1,1,1,1,1,1
2,3,3,3,2,2,3,2,2,2,3,1,3,3,3,2,3,3,3,3,1,3,3,3,3,3,1,3,4,7,5,1,7,5,5,5,5,5,4,5,4,5,5,3,6,7,1,51,2,,,1,3,5,3,5,3,2,5,5,2,2,2,1,1,1,2,2,2,2,2,2,2,2,5,1,1, ,1,1,2,1, ,1,3,3,5,5,5
2,1,3,2,2,1,3,3,3,3,2,1,3,1,2,1,3,1,2,3,1,2,3,3,3,3,3,4,4,5,4,4,5,3,3,3,3,,,2,2,1,1,2,2,3,2,57,14,,,1,2,6,6,4,3,3,1,3,1,2,1,2,2,2,1,2,2,1,2,2,5,1,1,1,1, ,1,1,1,1, ,4,4,4,2,4,3
3,2,2,3,2,3,3,1,3,3,1,3,3,2,2,3,3,1,3,3,2,3,3,3,2,3,5,3,3,6,6,4,4,3,2,5,5,5,1,3,3,2,2,7,7,6,2,24,5,1,2,2,4,6,4,5,5,1,5,5,4,2,2,2,2,2,2,2,2,2,2,2,3,1,1,1,1, ,1,1,1,1, ,1,2,1,1,2,2
2,2,3,3,2,1,3,3,2,3,2,1,3,3,3,1,3,1,2,1,1,1,1,3,1,3,4,4,5,7,7,7,4,3,2,4,4,3,4,3,4,2,1,5,5,7,2,24,12,1,1,1,3,7,6,5,5,1,5,5,3,2,2,2,1,1,2,1,2,2,2,2,3,1,1,1,1, ,1,1,1,1, ,1,2,1,1,2,2
2,2,2,3,2,1,2,1,2,2,2,1,3,3,3,3,3,3,3,1,1,1,3,3,1,3,1,5,2,7,6,6,4,4,3,2,1,3,1,1,3,1,1,1,5,6,2,29,3,1,2,1,2,8,4,4,3,4,5,4,1,2,2,2,1,2,2,2,2,2,2,2,3,1,1,1,1, ,1,1,1,1, ,1,5,1,1,3,3
3,2,2,2,1,3,2,1,1,3,2,1,3,3,3,1,3,2,1,2,1,1,3,1,1,1,1,5,5,7,6,6,4,3,4,5,1,4,,1,3,1,1,4,5,5,2,27,3,2,4,1,2,1,6,1,5,1,5,5,3,2,2,1,2,2,1,2,2,2,2,2,5,1,1,1,1, ,1,1,1,1, ,1,1,1,1,1,1
3,1,1,1,1,1,2,1,1,3,3,1,3,2,1,1,3,1,2,1,1,1,1,1,3,1,3,3,7,4,4,4,4,5,5,5,5,5,1,1,5,5,3,4,7,7,1,25,12,2,4,1,3,4,4,5,2,5,5,4,5,2,2,2,2,2,2,2,2,2,2,2,1,5,1,5,1, ,1,1,1,1, ,1,3,2,1,5,1